ERREUR: Impossible de construire l’extension native gem sur Mavericks

Je tente d’exécuter un bundle dans mon projet Rails sous OSX 10.9. Il échoue lorsqu’on parvient à la gem pg avec cette erreur:

 Gem::Installer::ExtensionBuildError: ERROR: Failed to build gem native extension. /Users/kyledecot/.rvm/rubies/ruby-2.0.0-p247/bin/ruby extconf.rb checking for pg_config... no No pg_config... trying anyway. If building fails, please try again with --with-pg-config=/path/to/pg_config checking for libpq-fe.h... yes checking for libpq/libpq-fs.h... yes checking for pg_config_manual.h... yes checking for PQconnectdb() in -lpq... yes checking for PQconnectionUsedPassword()... yes checking for PQisthreadsafe()... yes checking for PQprepare()... yes checking for PQexecParams()... yes checking for PQescapeSsortingng()... yes checking for PQescapeSsortingngConn()... yes checking for PQescapeLiteral()... yes checking for PQescapeIdentifier()... yes checking for PQgetCancel()... yes checking for lo_create()... yes checking for pg_encoding_to_char()... yes checking for pg_char_to_encoding()... yes checking for PQsetClientEncoding()... yes checking for PQlibVersion()... yes checking for PQping()... yes checking for PQsetSingleRowMode()... yes checking for rb_encdb_alias()... yes checking for rb_enc_alias()... no checking for rb_thread_call_without_gvl()... yes checking for rb_thread_call_with_gvl()... yes checking for rb_thread_fd_select()... yes checking for rb_w32_wrap_io_handle()... no checking for PGRES_COPY_BOTH in libpq-fe.h... no checking for PGRES_SINGLE_TUPLE in libpq-fe.h... no checking for PG_DIAG_TABLE_NAME in libpq-fe.h... no checking for struct pgNotify.extra in libpq-fe.h... yes checking for unistd.h... yes checking for ruby/st.h... yes creating extconf.h creating Makefile make "DESTDIR=" compiling gvl_wrappers.c clang: warning: argument unused during compilation: '-fno-fast-math' compiling pg.c clang: warning: argument unused during compilation: '-fno-fast-math' pg.c:272:9: warning: implicit declaration of function 'PQlibVersion' is invalid in C99 [-Wimplicit-function-declaration] return INT2NUM(PQlibVersion()); ^ In file included from pg.c:48: In file included from ./pg.h:17: In file included from /Users/kyledecot/.rvm/rubies/ruby-2.0.0-p247/include/ruby-2.0.0/ruby.h:33: /Users/kyledecot/.rvm/rubies/ruby-2.0.0-p247/include/ruby-2.0.0/ruby/ruby.h:1167:21: note: instantiated from: # define INT2NUM(v) INT2FIX((int)(v)) ^ pg.c:272:9: note: instantiated from: return INT2NUM(PQlibVersion()); ^ pg.c:272:17: note: instantiated from: return INT2NUM(PQlibVersion()); ^ pg.c:375:48: error: use of undeclared identifier 'PQPING_OK' rb_define_const(rb_mPGconstants, "PQPING_OK", INT2FIX(PQPING_OK)); ^ pg.c:375:56: note: instantiated from: rb_define_const(rb_mPGconstants, "PQPING_OK", INT2FIX(PQPING_OK)); ^ pg.c:377:52: error: use of undeclared identifier 'PQPING_REJECT' rb_define_const(rb_mPGconstants, "PQPING_REJECT", INT2FIX(PQPING_REJECT)); ^ pg.c:377:60: note: instantiated from: rb_define_const(rb_mPGconstants, "PQPING_REJECT", INT2FIX(PQPING_REJECT)); ^ pg.c:379:57: error: use of undeclared identifier 'PQPING_NO_RESPONSE' rb_define_const(rb_mPGconstants, "PQPING_NO_RESPONSE", INT2FIX(PQPING_NO_RESPONSE)); ^ pg.c:379:65: note: instantiated from: rb_define_const(rb_mPGconstants, "PQPING_NO_RESPONSE", INT2FIX(PQPING_NO_RESPONSE)); ^ pg.c:381:56: error: use of undeclared identifier 'PQPING_NO_ATTEMPT' rb_define_const(rb_mPGconstants, "PQPING_NO_ATTEMPT", INT2FIX(PQPING_NO_ATTEMPT)); ^ pg.c:381:64: note: instantiated from: rb_define_const(rb_mPGconstants, "PQPING_NO_ATTEMPT", INT2FIX(PQPING_NO_ATTEMPT)); ^ 1 warning and 4 errors generated. make: *** [pg.o] Error 1 Gem files will remain installed in /Users/kyledecot/.rvm/gems/ruby-2.0.0-p247@skateboxes/gems/pg-0.17.0 for inspection. Results logged to /Users/kyledecot/.rvm/gems/ruby-2.0.0-p247@skateboxes/gems/pg-0.17.0/ext/gem_make.out An error occurred while installing pg (0.17.0), and Bundler cannot continue. Make sure that `gem install pg -v '0.17.0'` succeeds before bundling. 

Assurez-vous également que vous avez mis à niveau Xcode pour réinstaller les outils de ligne de commande sur Mavericks. En type de terminal:

 xcode-select --install 

Suivez ensuite les instructions.

Pour moi, cela a fonctionné quand j’ai fait:

 brew install postgresql 

Cela a fonctionné pour moi avec Mavericks et le Postgresapp:

 gem install pg -v '0.17.0' -- --with-pg-config=/Applications/Postgres93.app/Contents/MacOS/bin/pg_config 

Essayez d’utiliser l’argument --with-pg-config :

 bundle config build.pg --with-pg-config=/usr/pgsql-9.1/bin/pg_config 

Pour afficher le chemin du pg_config :

 which pg_config 

Pour les utilisateurs d’Ubuntu:

 sudo apt-get install postgresql sudo apt-get install libpq-dev 

Alors:

 bundle install 

Pour moi en utilisant Mavericks, Rails 3.2.13, Ruby 2.0.0-p247, PostgreSQL 9.1, j’avais besoin de faire ceci:

 gem install pg -v '0.15.1' -- --with-pg-config=/Library/PostgreSQL/9.1/bin/pg_config 

Je viens de le faire en faisant

 ARCHFLAGS="-arch x86_64" gem install pg 

après l’installation de posgres à l’aide de l’infusion

Cela a fonctionné pour moi sur Mac OS X 10.9.3 et Postgres.app version 9.3.4.2:

1) Installer Postgres.app

2) bundle config build.pg --with-pg-config=/Applications/Postgres.app/Contents/Versions/9.3/bin/pg_config

3) gem install pg -v '0.17.1'

4) bundle install

Quand j’essaye d’installer

 apt-get install libpq-dev 

Échec d’installation, problème de dépendances non résolu, à résoudre

 apt-get remove libpq5 

puis installez

 apt-get install libpq-dev 

Finalement résolu le problème de gem pg.

Les suivants ont fonctionné pour moi:

gem install pg -v ‘0.18.1’ – –with-pg config = / Bibliothèque / PostgreSQL / 9.3 / bin / pg_config

Vous devez configurer pg avec votre version actuelle J’ai utilisé la version 9.4 de ma version sur Yosemite. Voici la commande suivante

 bundle config build.pg --with-pg-config=/Applications/Postgres.app/Contents/Versions/9.4/bin/pg_config 

Vous devriez utiliser votre propre version

 bundle config build.pg --with-pg-config=/Applications/Postgres.app/Contents/Versions/(YOUR POSTGRES VERSION)/bin/pg_config 

alors fais

 bundle install 

An error occurred while installing debugger (1.6.5), and Bundler cannot continue. Make sure that `gem install debugger -v '1.6.5'` succeeds before bundling.

J’ai pu corriger cette erreur en revenant à Ruby v2.0.0. J’exécutais Ruby 2.1.1, qui n’est pas pris en charge pour cette version de débogueur. Assurez-vous de vérifier votre version de Ruby si vous rencontrez également ce problème.